{"text_format":"1","workbook":"xlsx","n_sheets":11,"sheets":["Survey Set-Up","Instructions","Instructions ","DSH Waiver & MIUR Data","Variance","DSH Qualification","Sec. A-C DSH Year Data","Sec. A-C DSH Year Data ADJ","Checklist","Exam Adjustments","Calculation"],"not_rendered":{"charts":0,"images":0,"macros":1,"external_links":0,"defined_names":230,"comments":0,"pivot_tables":0},"unopened":[],"bounds":{"document_bytes":16777216,"sheet_cells":100000,"rows_first":2000,"rows_last":500,"rows_between":2000,"halvings":0,"cell_chars":16384,"cell_head_chars":4096},"cells_cut":0,"cells_raw":0,"read":"whole","date_system":"1900"}

{"sheet":"Survey Set-Up","index":0,"n_rows":176,"n_cols":21,"rows_kept":176,"cut":false,"hidden":true,"merged":[[5,3,6,8],[175,0,175,13],[9,7,9,8]]}
["State:","Louisiana",null,"Year:",{"$f":"YEAR(DSH_Year_End)","v":2019},{"$f":"Year-1","v":2018},"Including Section L (provider tax form) in Part II?",null,null,null,"Yes",null,"Hospital Type","All Others",null,null,null,null,null,null,"I hereby certify that the information in Sections A, B, C, D, E, F, G, H, I, J, K and L of the DSH Survey files are true and accurate to the best of our ability, and supported by the financial and other records of the hospital. All Medicaid eligible patients, including those who have private insurance coverage, have been reported on the DSH survey regardless of whether the hospital received payment on the claim. I understand that this information will be used to determine the Medicaid program's compliance with federal Disproportionate Share Hospital (DSH) eligibility and payments provisions. Detailed support exists for all amounts reported in the survey. These records will be retained for a period of not less than 5 years following the due date of the survey, and will be made available for inspection when requested. "]
[null,null,null,null,"↑NOTE: DO NOT overwrite formula in cell above. Update DSH Year by entering begin/end dates on Sec. A.",null,null,null,null,null,null,null,"High Medicaid Pool Threshold",null,null,null,null,null,null,null,"I hereby certify that the information in Sections A, B, C, D, E, F, G, H, I, J, and K of the DSH Survey files are true and accurate to the best of our ability, and supported by the financial and other records of the hospital. All Medicaid eligible patients, including those who have private insurance coverage, have been reported on the DSH survey regardless of whether the hospital received payment on the claim. I understand that this information will be used to determine the Medicaid program's compliance with federal Disproportionate Share Hospital (DSH) eligibility and payments provisions. Detailed support exists for all amounts reported in the survey. These records will be retained for a period of not less than 5 years following the due date of the survey, and will be made available for inspection when requested. "]
[null,"Submission Information  (Flows to Checklist Sheet)",null,"Are you using the Myers and Stauffer DSH Web Portal?",null,null,null,null,"Yes",null,null,null,null,null,null,null,null,null,null,null,"I hereby certify that the information in Sections A, B, C, D, E, F, G, H, I, J, K, L, M, N, O, and P, and the DSH Qualification section of the DSH Survey files are true and accurate to the best of our ability, and supported by the financial and other records of the hospital. All Medicaid eligible patients, including those who have private insurance coverage, have been reported on the DSH survey regardless of whether the hospital received payment on the claim. I understand that this information will be used to determine the Medicaid program's compliance with federal Disproportionate Share Hospital (DSH) eligibility and payments provisions. Detailed support exists for all amounts reported in the survey. These records will be retained for a period of not less than 5 years following the due date of the survey, and will be made available for inspection when requested. "]
[null,"Myers and Stauffer LC",null,null,null,null,null,null,null,null,null,null,null,null,null,null,null,null,null,null,"I hereby certify that the information in Sections A, B, C, D, E, F, G, H, I, J, K, L, M, N, O, and P, and the DSH Qualification section of the DSH Survey files are true and accurate to the best of our ability, and supported by the financial and other records of the hospital. All Medicaid eligible patients, including those who have private insurance coverage, have been reported on the DSH survey regardless of whether the hospital received payment on the claim. I understand that this information will be used to determine the Medicaid program's compliance with federal Disproportionate Share Hospital (DSH) eligibility and payments provisions. Detailed support exists for all amounts reported in the survey. These records will be retained for a period of not less than 5 years following the due date of the survey, and will be made available for inspection when requested. "]
[null,"ATTN:  DSH Examinations"]
[null,"700 W. 47th Street, Suite 1100",null,"After entering state, click on \"Run page setup\" below to set-up the headers and footers with the state name and year (in all sheets).  This is a slow process so be patient!",null,null,null,null,null,null,null,null,null,null,null,null,null,null,null,null,"The information provided above is true and accurate to the best of our ability, and supported by the financial and other records of the hospital.  I understand that a hospital that does not receive an interim DSH payment for a SFY will not be included in the independent DSH examination related to that SFY and will not be eligible for final DSH examination payment adjustments related to that SFY unless it submits a request to the MO HealthNet Division to be included in the independent DSH examination."]
[null,"Kansas City, Missouri 64112",null,null,null,null,null,null,null,null,null,null,null,null,null,null,null,null,null,null,"The information provided above is true and accurate to the best of our ability, and supported by the financial and other records of the hospital.  I understand that a hospital that does not receive an interim DSH payment for a SFY will not be included in the independent DSH examination related to that SFY and will not be eligible for final DSH examination payment adjustments related to that SFY."]
[null,"Fax:  (816) 945-5301"]
[null,"Phone:  (800) 374-6858",null,null,null,null,null,null,null,null,null,null,null,null,null,null,null,null,null,null,"If you selected \"Yes\" above, you must fill out the days below.  CMS requires that the State of Missouri submit the MIUR for each hospital in the state that receives a Medicaid payment.  This information is necessary for the accurate reporting of the MIUR and may affect future federal funding."]
[null,"E-Mail: LADSH@mslc.com",null,null,null,null,null,"Output Directory:",null,"G:\\Data\\State Data\\Louisiana\\DSH Payment Calculation\\SFY 2019 UCC Analysis\\06 Uploads\\Survey Part I\\",null,null,null,null,null,null,null,null,null,null,"If you selected \"Yes\" above, you must fill out the days below.  CMS requires that the Department submit the MIUR for each hospital in the state that receives a Medicaid payment.  This information is necessary for the accurate reporting of the MIUR and may affect future federal funding."]
{"$rows_left_out":167}
{"sheet":"Instructions","index":1,"n_rows":23,"n_cols":3,"rows_kept":23,"cut":false,"hidden":true,"merged":[[23,0,23,2],[22,0,22,2]]}
["A. General Instructions and Identification of Cost Reports that Cover the DSH Year:"]
[]
["1.",null,"Select the \"Sec. A-C DSH Year Data\" tab in Excel workbook.  In row 1, select your facility from the drop-down menu provided (if not already populated).  When your facility is selected, the following fields will be populated: in-state Medicaid provider number and Medicare provider number.  Review information and indicate whether it is correct or incorrect.  If incorrect, provide correct information."]
[]
["2.",null,"Provide your cost reporting periods that are needed to completely cover the DSH year.  If the end date for cost report period 1 is before the end date of the DSH year, report your next cost reporting period (cost report 2).  If this cost report ends prior to the end of the DSH year, report your next cost reporting period (cost report 3).  The cost reporting periods must cover the entire DSH year. "]
[null,null,{"$f":"\"NOTE: For the \"&Year&\" DSH Survey, if your hospital completed the DSH survey for \"&PriorYear&\", the first cost report year should follow the last cost report year reported on the \"&PriorYear&\" DSH survey. The last cost report year on the \"&Year&\" survey must end on or after the end of the \"&Year&\" DSH year. If your hospital did not complete the \"&PriorYear&\" survey, your cost reports for \"&Year&\" must cover the entire \"&Year&\" DSH year.\"","v":"NOTE: For the 2019 DSH Survey, if your hospital completed the DSH survey for 2018, the first cost report year should follow the last cost report year reported on the 2018 DSH survey. The last cost report year on the 2019 survey must end on or after the end of the 2019 DSH year. If your hospital did not complete the 2018 survey, your cost reports for 2019 must cover the entire 2019 DSH year."}]
[]
["3.",null,"Supporting documentation for all data elements provided within the DSH survey must be maintained for a minimum of five years from the date of survey submission."]
["B. DSH OB Qualifying Information:"]
[]
{"$rows_left_out":14}
{"sheet":"Instructions ","index":2,"n_rows":28,"n_cols":7,"rows_kept":28,"cut":false,"hidden":false,"merged":[[27,0,27,2],[28,0,28,2]]}
[{"$f":"IF(State=\"Missouri\",Missouri_Title,IF(State=\"Louisiana\",Louisiana_Title,\"\"))","v":"DSH Qualification"},null,null,null,null,"DSH Waiver & MIUR Data","A DSH Waiver & MIUR Data form is included in DSH Survey Part I. A hospital that did not receive an interim DSH payment for the year under examination and elects not to receive a Missouri Medicaid interim DSH payment for the upcoming interim DSH payment year must complete the DSH Waiver & MIUR Data form and indicate it elects not to receive an interim DSH payment.  The hospital must also complete the “Days” section on the DSH Waiver & MIUR Data form so the hospital’s MIUR may be calculated. However, the remainder of DSH Year Survey Part I and all of DSH Year Survey Part II do not need to be completed.  CMS requires the state of Missouri to submit the MIUR for each hospital in the state that receives a Medicaid payment.  It is important that the “Days” section is completed so the MIUR can be accurately reported to CMS as the MIUR data may affect future federal funding.    "]
[null,null,null,null,null,"DSH Qualification","In order for a hospital to be eligible to receive a DSH payment, the hospital must 1) have filed a year end cost report in accordance with Medicare filing guidelines, including extensions; 2) meet the qualification criteria as identified in the \"DSH Qualification\" tab; 3) have a minimum of 1% Medicaid days utilization percentage; and 4) meet obstetrical services criteria as identified in Section B of the \"Sec. A-C DSH Year Data\" tab."]
[{"$f":"IF(OR(State=\"Missouri\",State=\"Louisiana\"),1,\"\")","v":1},null,{"$f":"IF(State=\"Missouri\",Missouri_Instructions,IF(State=\"Louisiana\",Louisiana_Instructions,\"\"))","v":"In order for a hospital to be eligible to receive a DSH payment, the hospital must 1) have filed a year end cost report in accordance with Medicare filing guidelines, including extensions; 2) meet the qualification criteria as identified in the \"DSH Qualification\" tab; 3) have a minimum of 1% Medicaid days utilization percentage; and 4) meet obstetrical services criteria as identified in Section B of the \"Sec. A-C DSH Year Data\" tab."}]
[]
["A. General Instructions and Identification of Cost Reports that Cover the DSH Year:"]
[]
["1.",null,"Select the \"Sec. A-C DSH Year Data\" tab in Excel workbook.  In row 1, select your facility from the drop-down menu provided (if not already populated).  When your facility is selected, the following fields will be populated: in-state Medicaid provider number and Medicare provider number.  Review information and indicate whether it is correct or incorrect.  If incorrect, provide correct information."]
[]
["2.",null,"Provide your cost reporting periods that are needed to completely cover the DSH year.  If the end date for cost report period 1 is before the end date of the DSH year, report your next cost reporting period (cost report 2).  If this cost report ends prior to the end of the DSH year, report your next cost reporting period (cost report 3).  The cost reporting periods must cover the entire DSH year. "]
[null,null,{"$f":"\"NOTE: For the \"&Year&\" DSH Survey, if your hospital completed the DSH survey for \"&PriorYear&\", the first cost report year should follow the last cost report year reported on the \"&PriorYear&\" DSH survey. The last cost report year on the \"&Year&\" survey must end on or after the end of the \"&Year&\" DSH year. If your hospital did not complete the \"&PriorYear&\" survey, your cost reports for \"&Year&\" must cover the entire \"&Year&\" DSH year.\"","v":"NOTE: For the 2019 DSH Survey, if your hospital completed the DSH survey for 2018, the first cost report year should follow the last cost report year reported on the 2018 DSH survey. The last cost report year on the 2019 survey must end on or after the end of the 2019 DSH year. If your hospital did not complete the 2018 survey, your cost reports for 2019 must cover the entire 2019 DSH year."}]
{"$rows_left_out":19}
{"sheet":"DSH Waiver & MIUR Data","index":3,"n_rows":84,"n_cols":10,"rows_kept":84,"cut":false,"hidden":true,"merged":[[14,1,14,6],[38,2,38,3],[5,4,5,6],[67,1,67,6],[28,1,28,8],[29,1,29,8],[30,1,30,8],[21,1,21,7],[50,1,50,6],[51,1,51,6],[18,1,18,9]]}
[]
["DSH Waiver & MIUR Data Form"]
[]
["General Information & DSH Waiver"]
[]
[1,"Hospital Name",null,null,{"$f":"HOSPITALNAME_ADJ","v":"SELECT HOSPITAL NAME"}]
[]
[2,{"$f":"IF(State=\"Missouri\",\"Missouri Medicaid Provider Number:\",\"Medicaid Provider Number:\")","v":"Medicaid Provider Number:"},null,null,{"$f":"McaidNum_ADJ","v":"M'Caid #"}]
[]
[]
{"$rows_left_out":75}
{"sheet":"Variance","index":4,"n_rows":4,"n_cols":1,"rows_kept":4,"cut":false,"hidden":true,"merged":[[3,1,16,12]]}
[]
["Please explain variances below."]
[]
[13]

{"sheet":"DSH Qualification","index":5,"n_rows":213,"n_cols":12,"rows_kept":213,"cut":false,"hidden":false,"merged":[[14,0,18,9]]}
[]
["Louisiana DSH Pool-Specific Qualification Questionnaire"]
[]
["Small Rural Hospital Pool:"]
[]
["In order to determine eligibility for inclusion as a rural hospital under Act 1485 of the 1997 Louisiana Legislature, Act 1068 and Senate Concurrent "]
["Resolution 48 of the 1999 Louisiana Legislature, Act 1074 of the 2001 Legislature, Act 35 of the 2002 First Extraordinary Session of the Louisiana "]
["Legislature, Acts 526 and 1148 of the 2003 Legislature, Act 323 of the 2005 Legislature, Act 389 of the 2008 Legislature, Act 147 of the 2010 "]
["Legislature and our approved state plan, the Louisiana Department of Health and Hospitals requests that you provide the following data:"]
[]
{"$rows_left_out":204}
{"sheet":"Sec. A-C DSH Year Data","index":6,"n_rows":105,"n_cols":31,"rows_kept":105,"cut":false,"hidden":false,"merged":[[104,2,104,5],[102,9,102,12],[67,1,67,4],[103,9,103,12],[101,2,101,5],[99,9,99,12],[84,1,84,13],[93,4,93,6],[88,1,88,10],[85,1,85,13],[83,2,83,13],[103,2,103,5],[102,2,102,5],[101,9,101,12],[90,4,90,6],[100,9,100,12],[99,2,99,5],[100,2,100,5],[93,10,93,12],[5,2,5,6],[66,1,66,4],[11,6,11,13],[12,6,12,13],[50,1,50,4],[51,1,51,4],[13,6,13,13],[60,1,60,4],[61,1,61,4],[16,2,16,4]]}
[null,null,null,null,null,null,null,null,"DSH Version",null,5.25,null,"2018-12-03",null,null,null,null,null,null,null,null,null,null,null,null,null,null,null,{"$f":"State","v":"Louisiana"},null,"Yes"]
["A.  General DSH Year Information",null,null,null,null,null,null,null,null,null,null,null,null,null,null,null,null,null,null,null,null,null,null,null,null,null,null,null,{"$f":"Waiver_Response","v":0},null,"No"]
[null,null,"Begin",null,"End"]
["1.","DSH Year:","2018-07-01",null,"2019-06-30"]
[]
["2.","Select Your Facility from the Drop-Down Menu Provided:","SELECT HOSPITAL NAME"]
[]
[]
[null,"Identification of cost reports needed to cover the DSH Year:"]
[null,null,"Cost Report",null,"Cost Report"]
{"$rows_left_out":96}
{"sheet":"Sec. A-C DSH Year Data ADJ","index":7,"n_rows":105,"n_cols":31,"rows_kept":105,"cut":false,"hidden":true,"merged":[[100,2,100,5],[100,9,100,12],[90,4,90,6],[93,4,93,6],[93,8,93,10],[104,2,104,5],[101,2,101,5],[101,9,101,12],[102,2,102,5],[102,9,102,12],[103,2,103,5],[103,9,103,12],[85,1,85,13],[88,1,88,10],[60,1,60,4],[61,1,61,4],[99,2,99,5],[99,9,99,12],[84,1,84,13],[5,2,5,6],[16,2,16,4],[66,1,66,4],[67,1,67,4],[83,2,83,13],[50,1,50,4],[51,1,51,4]]}
[null,null,null,null,null,null,null,null,"DSH Version",null,{"$f":"Version","v":5.25},null,{"$f":"'Sec. A-C DSH Year Data'!M1","v":"2018-12-03"},null,null,null,null,null,null,null,null,null,null,null,null,null,null,null,null,null,{"$f":"State","v":"Louisiana"}]
["A.  General DSH Year Information",null,null,null,null,null,null,null,null,null,null,null,null,null,null,null,null,null,null,null,null,null,null,null,null,null,null,null,"IOWA",null,{"$f":"Waiver_Response","v":0}]
[null,null,"Begin",null,"End",null,null,null,"Workpaper #:",null,null,null,"Reviewer:",null,null,null,null,null,null,null,null,null,null,null,null,null,null,null,"ARIZONA "]
["1.","DSH Year:",{"$f":"DSH_Year_Begin","v":"2018-07-01"},null,{"$f":"DSH_Year_End","v":"2019-06-30"},null,null,null,"Examiner:",null,null,null,null,null,null,null,null,null,null,null,null,null,null,null,null,null,null,null,"ARKANSAS"]
[null,null,null,null,null,null,null,null,"Date:"]
["2.","Select Your Facility from the Drop-Down Menu Provided:",{"$f":"HOSPITALNAME","v":"SELECT HOSPITAL NAME"},null,null,null,null,null,null,null,null,null,null,null,null,null,null,null,null,null,null,null,null,null,null,null,null,null,"ALABAMA"]
[null,null,null,null,null,null,null,null,null,null,null,null,null,null,null,null,null,null,null,null,null,null,null,null,null,null,null,null,"ALASKA"]
[null,null,null,null,null,null,null,null,null,null,null,null,null,null,null,null,null,null,null,null,null,null,null,null,null,null,null,null,"COLORADO "]
[null,"Identification of cost reports needed to cover the DSH Year:",null,null,null,null,null,null,null,null,null,null,null,null,null,null,null,null,null,null,null,null,null,null,null,null,null,null,"CONNECTICUT"]
[null,null,"Cost Report",null,"Cost Report"]
{"$rows_left_out":96}
{"sheet":"Checklist","index":8,"n_rows":41,"n_cols":11,"rows_kept":41,"cut":false,"hidden":false,"merged":[[40,4,40,14],[18,4,18,14],[32,4,32,13],[16,4,16,14],[23,4,23,14],[21,4,21,14],[22,4,22,14],[25,4,25,14],[24,4,24,14],[17,4,17,14],[19,4,19,14],[20,5,20,14],[15,4,15,14],[31,4,31,13],[7,5,7,14],[13,5,13,14],[12,4,12,14],[2,4,2,14],[30,4,30,13],[10,5,10,14],[27,4,27,14],[1,1,1,14],[26,4,26,14],[8,4,8,14],[11,4,11,14],[14,4,14,14],[6,1,7,1],[9,1,10,1],[12,1,13,1],[19,1,20,1],[3,4,3,14],[4,4,4,14],[5,4,5,14]]}
["DSH Survey Submission Checklist",null,null,null,null,null,null,null,null,null,"Act 540 only providers need only submit the highlighted items."]
[null,"Please indicate with an \"X\" each item included or a \"N/A\" if not included.  Consider a separate cover letter to explain any \"N/A\" answers to avoid additional documentation requests."]
[null,null,null,"1.",{"$f":"CONCATENATE(\"Electronic copy of the DSH Survey Part I - DSH Year Data -  \", TEXT(DSH_Year_Begin,\"mm/dd/yyyy\"), \" - \", TEXT(DSH_Year_End,\"mm/dd/yyyy\"))","v":"Electronic copy of the DSH Survey Part I - DSH Year Data -  07/01/2018 - 06/30/2019"}]
[null,null,null,"2.",{"$f":" CONCATENATE(\"Electronic copy of the DSH Survey Part II - Cost Report Data - Cost Report Year \", TEXT(FYB_1,\"mm/dd/yyyy\"), \" - \", TEXT(FYE_1,\"mm/dd/yyyy\"))","v":"Electronic copy of the DSH Survey Part II - Cost Report Data - Cost Report Year  - "}]
[null,null,null,"3.",{"$f":"CONCATENATE(\"Electronic copy of the RHC Survey - Cost Report Year \",TEXT(FYB_1,\"mm/dd/yyyy\"),\" - \",TEXT(FYE_1,\"mm/dd/yyyy\"),\" if applicable.\")","v":"Electronic copy of the RHC Survey - Cost Report Year  -  if applicable."}]
[null,null,null,"4.",{"$f":"IF(ISNUMBER('Sec. A-C DSH Year Data'!E14),CONCATENATE(\"Electronic copy of the DSH Survey Part II - Cost Report Data - Cost Report Year \", TEXT(FYB_3,\"mm/dd/yyyy\"), \" - \", TEXT(FYE_3,\"mm/dd/yyyy\")),\"N/A\")","v":"N/A"}]
[null,null,null,"5 (a).","Electronic copy of Exhibit A - Uninsured Charges / Days"]
[null,null,null,null,null,"- Must be in Excel (.xls or .xlsx) or CSV (.csv) using either a TAB or | (pipe symbol above the ENTER key)"]
[null,null,null,"5 (b).","Description of logic used to compile Exhibit A.  Include a copy of all financial classes and payer plan codes utilized during the cost report period and a description of which codes were included or excluded if applicable."]
[null,null,null,"6 (a).","Electronic copy of Exhibit B - Self-Pay Payments"]
{"$rows_left_out":32}
{"sheet":"Exam Adjustments","index":9,"n_rows":26,"n_cols":11,"rows_kept":26,"cut":false,"hidden":true,"merged":[[6,0,6,9],[2,2,2,7],[0,0,0,9],[5,0,5,10]]}
["Medicaid DSH Survey Adjustments"]
[]
["PROVIDER:",null,{"$f":"'Sec. A-C DSH Year Data ADJ'!C6:G6","v":"SELECT HOSPITAL NAME"},null,null,null,null,null,"Mcaid Number:",{"$f":"McaidNum_ADJ","v":"M'Caid #"}]
["FROM:",null,{"$f":"DSH_Year_Begin","v":"2018-07-01"},null,"TO:",{"$f":"DSH_Year_End","v":"2019-06-30"},null,null,"Mcare Number:",{"$f":"McareNum_ADJ","v":"M'care #"}]
[]
["Myers and Stauffer DSH Survey Adjustments"]
[]
["Adj. #","Schedule","Line #","Line Description","Column","Column Description","Year","Explanation for Adjustment","Original Amount","Adjustment","Adjusted Total"]
[null,"Certification",1,"Retain 100% of DSH Payment?","1.00","Answer",{"$f":"DSH_Year_End","v":"2019-06-30"},"Adjust answer based on examination results.",{"$f":"RetainDSHYes","v":0},{"$f":"IF(K9<>I9,K9,0)","v":0},{"$f":"RetainDSHYes_ADJ","v":0}]
[null,"B - DSH OB Qualifying Information",1,"Have two OBs?","1.00","Answer","2019-06-30","Adjust answer based on examination results.",{"$f":"OBYes","v":0},0,{"$f":"OBYes_ADJ","v":0}]
{"$rows_left_out":17}
{"sheet":"Calculation","index":10,"n_rows":49,"n_cols":7,"rows_kept":49,"cut":false,"hidden":true,"merged":[[44,2,44,5],[45,2,45,5],[46,2,46,5],[47,2,47,5],[48,2,48,5]]}
[]
[{"$f":"CONCATENATE(\"SFY \",Year, \" Survey Shortfall/(Longfall) Preliminary Calculation\")","v":"SFY 2019 Survey Shortfall/(Longfall) Preliminary Calculation"},null,"All the data used here are ONLY for SFY claims falling within the cost report period."]
[]
[]
["Provider Information:"]
[]
[null,null,"Data"]
["1a.","Medicaid #",{"$f":"VLOOKUP(HOSPITALNAME,DATATABLE,2,FALSE)","v":"M'Caid #"}]
["1b.","Provider Name",{"$f":"HOSPITALNAME","v":"SELECT HOSPITAL NAME"}]
["1c.","Medicare #",{"$f":"VLOOKUP(HOSPITALNAME,DATATABLE,5,FALSE)","v":"M'care #"}]
{"$rows_left_out":39}